# Test Failure on Dunning Project

**URL:** <https://forum.metasfresh.org/t/test-failure-on-dunning-project/1357>\
**Category:** Setup\
**Created:** [November 8, 2018, 6:32am UTC](https://forum.metasfresh.org/t/test-failure-on-dunning-project/1357 "2018-11-08T06:32:15Z")\
**Posts on this page:** 3\
**Page:** 1

<div class="post-metadata">

**Author:** ![dev](https://forum.metasfresh.org/letter_avatar_proxy/v4/letter/d/e8c25b/32.png) [@dev](https://forum.metasfresh.org/u/dev)\
**Post date:** [November 8, 2018, 6:32am UTC](https://forum.metasfresh.org/t/test-failure-on-dunning-project/1357/1 "2018-11-08T06:32:15Z")

</div>

All -

When I run MVN install under metasfresh -  
It says that the test has failed. for Dunning.  
I get the following error (Looking under sure-fire reports):

* * *

## Test set: de.metas.dunning.api.impl.DefaultDunningProducerTest

Tests run: 1, Failures: 1, Errors: 0, Skipped: 0, Time elapsed: 0.281 s \<\<\< FAILURE! - in de.metas.dunning.api.impl.DefaultDunningProducerTest  
test\_OneDocumentForEachCandidate(de.metas.dunning.api.impl.DefaultDunningProducerTest) Time elapsed: 0.275 s \<\<\< FAILURE!  
java.lang.AssertionError: DunningDoc - Invalid Processed expected: but was:  
at de.metas.dunning.api.impl.DefaultDunningProducerTest.assertValid(DefaultDunningProducerTest.java:151)  
at de.metas.dunning.api.impl.DefaultDunningProducerTest.assertDunningDocValid(DefaultDunningProducerTest.java:124)  
at de.metas.dunning.api.impl.DefaultDunningProducerTest.test\_OneDocumentForEachCandidate(DefaultDunningProducerTest.java:80)

---

<div class="post-metadata">

**Author:** ![dev](https://forum.metasfresh.org/letter_avatar_proxy/v4/letter/d/e8c25b/32.png) [@dev](https://forum.metasfresh.org/u/dev)\
**Post date:** [November 9, 2018, 6:47am UTC](https://forum.metasfresh.org/t/test-failure-on-dunning-project/1357/2 "2018-11-09T06:47:47Z")

</div>

Commented out DefaultDunningProducerTest

Built like a charm!

Thanks

---

<div class="post-metadata">

**Author:** ![metas-ts](https://forum.metasfresh.org/user_avatar/forum.metasfresh.org/metas-ts/32/14_2.png) [@metas-ts](https://forum.metasfresh.org/u/metas-ts)\
**Post date:** [November 14, 2018, 7:25am UTC](https://forum.metasfresh.org/t/test-failure-on-dunning-project/1357/3 "2018-11-14T07:25:24Z")

</div>

Hi @dev  
sorry for the late reply.

FYI, I created this issue: [https://github.com/metasfresh/metasfresh/issues/4757](https://github.com/metasfresh/metasfresh/issues/4757)  
Thx for your effort so far.

Best regards  
Tobias
